{"text_format":"1","workbook":"xlsx","n_sheets":10,"sheets":["1) Questionnaire","2) HealthAssessment","3) SpendPlan","4) Milestones","5) Contract Management","RiskStrategyDefinitions","DeliverablesTracking","OPM Assessment","LOOKUPS","EvaluationCriteria"],"not_rendered":{"charts":0,"images":2,"macros":1,"external_links":0,"defined_names":85,"comments":3,"pivot_tables":0},"unopened":[],"bounds":{"document_bytes":16777216,"sheet_cells":100000,"rows_first":2000,"rows_last":500,"rows_between":2000,"halvings":0,"cell_chars":16384,"cell_head_chars":4096},"cells_cut":0,"cells_raw":0,"read":"whole","date_system":"1900"}

{"sheet":"1) Questionnaire","index":0,"n_rows":42,"n_cols":12,"rows_kept":42,"cut":false,"hidden":false,"merged":[[13,11,13,14],[14,11,14,14],[15,11,15,14],[1,5,1,6],[3,5,5,13],[7,5,8,13],[9,11,9,14],[10,11,10,14],[11,11,11,14],[12,11,12,14]]}
[{"$f":"CurrentVersion","v":"v6.02"}]
[null,"Health Assessment Questionnaire",null,null,null,"Select Reporting Month",null,"Jul/FY23"]
[null,"Responding accurately to the following questions will help determine the status of the project for this reporting period."]
[null,"SCOPE",null,null,null,"Please use the drop down options to respond to the 16 questions to the left. "]
[null,"1. Does the project have a well documented and approved project scope [such that it can be leveraged in the RFP(s)] consistent with the intentions of the project charter?",null,{"$f":"IF(OR(C12=0,C10=0,C8=0,C6=0),\"ERROR\",IF(OR(C12=2,C8=3,C6=3),\"R\",IF(OR(C10=1,C8=2,C6=2),\"Y\",IF(AND(C12=1,C10=2,C8=1,C6=1),\"G\",\"ERROR\"))))","v":"ERROR"}]
[null,"Select One  >",{"$f":"VLOOKUP(B6,Q1Lookup,2,FALSE)","v":0}]
[null,"2. Does the project have an actively managed backlog/list of features/specification/requirements?"]
[null,"Select One  >",{"$f":"VLOOKUP(B8,Q2Lookup,2,FALSE)","v":0},null,null,"The questionnaire should be completed each month."]
{"$rows_left_out":35}
{"sheet":"2) HealthAssessment","index":1,"n_rows":27,"n_cols":18,"rows_kept":27,"cut":false,"hidden":false,"merged":[[15,10,15,14],[16,10,16,14],[8,10,8,17],[9,10,9,17],[10,10,10,17],[11,10,11,14],[12,10,12,14],[13,10,13,14],[14,10,14,14],[19,10,19,14],[20,10,20,14],[21,10,21,17],[22,10,22,17],[17,1,17,6],[17,8,17,9],[17,10,17,14],[18,1,18,6],[18,8,18,9],[18,10,18,14],[19,1,19,9],[1,1,1,4],[1,5,1,6],[1,7,1,9],[1,10,1,14],[2,5,2,6],[2,7,2,9],[2,10,2,14],[5,13,7,13],[5,14,7,14],[5,15,7,15],[5,16,7,16],[2,1,2,4],[3,1,3,9],[3,10,3,17],[4,10,4,11],[5,10,7,11],[5,12,7,12],[5,17,7,17],[4,1,7,9],[8,1,8,9],[9,1,9,9],[10,1,10,9],[11,1,11,6],[11,8,11,9],[12,8,12,9],[15,8,15,9],[16,8,16,9],[12,1,12,6],[13,1,13,6],[13,8,13,9],[14,1,14,6],[14,8,14,9],[15,1,15,6],[16,1,16,6]]}
[{"$f":"CurrentVersion","v":"v6.02"}]
[null,"Project Name / Enterprise Portfolio Name",null,null,null,"Hosting Agency",null,"Project Manager",null,null,"Participating Agencies",null,null,null,null,"FY Start","Procurement Awarded","Reporting Period "]
[null,"[Project Name]",null,null,null,"[Hosting Agency Name]",null,"[PM Name]",null,null,"[Agency's Name]",null,null,null,null,"[MITDP FY Start]","[FY of Award]",{"$f":"Reporting_Month","v":"Jul/FY23"}]
[null,"Project Description",null,null,null,null,null,null,null,null,"Health Status"]
[null,"[Enter the Project description]",null,null,null,null,null,null,null,null,"Overall Status",null,"Scope","Schedule","Cost","Risk","Quality","Resources"]
[null,null,null,null,null,null,null,null,null,null,{"$f":"Rating_Overall","v":"ERROR"},null,{"$f":"Rating_Scope","v":"ERROR"},{"$f":"Rating_Schedule","v":"ERROR"},{"$f":"Rating_Costs","v":"ERROR"},{"$f":"Rating_Risks","v":"ERROR"},{"$f":"Rating_Quality","v":"ERROR"},{"$f":"Rating_Resources","v":"ERROR"}]
[]
[]
{"$rows_left_out":20}
{"sheet":"3) SpendPlan","index":2,"n_rows":72,"n_cols":47,"rows_kept":72,"cut":false,"hidden":false,"merged":[[0,4,0,11],[1,4,1,5],[1,6,1,7],[1,8,1,9],[1,10,1,11],[2,1,2,3],[4,1,4,2],[4,22,4,23],[4,24,4,25],[4,26,4,27],[4,31,4,33],[4,8,4,9],[4,10,4,11],[4,12,4,13],[4,14,4,15],[4,16,4,17],[4,18,4,19],[4,20,4,21],[5,14,5,15],[5,16,5,17],[5,18,5,19],[5,20,5,21],[5,22,5,23],[5,24,5,25],[5,26,5,27],[4,4,4,5],[4,6,4,7],[5,4,5,5],[5,6,5,7],[5,8,5,9],[5,10,5,11],[5,12,5,13],[6,18,6,19],[6,20,6,21],[6,22,6,23],[6,24,6,25],[6,26,6,27],[6,4,6,5],[6,6,6,7],[6,8,6,9],[6,10,6,11],[6,12,6,13],[6,14,6,15],[6,16,6,17],[10,18,10,19],[10,20,10,21],[10,22,10,23],[10,24,10,25],[10,26,10,27],[10,4,10,5],[10,6,10,7],[10,8,10,9],[10,10,10,11],[10,12,10,13],[10,14,10,15],[10,16,10,17],[11,18,11,19],[11,20,11,21],[11,22,11,23],[11,24,11,25],[11,26,11,27],[11,4,11,5],[11,6,11,7],[11,8,11,9],[11,10,11,11],[11,12,11,13],[11,14,11,15],[11,16,11,17],[12,18,12,19],[12,20,12,21],[12,22,12,23],[12,24,12,25],[12,26,12,27],[12,4,12,5],[12,6,12,7],[12,8,12,9],[12,10,12,11],[12,12,12,13],[12,14,12,15],[12,16,12,17],[13,18,13,19],[13,20,13,21],[13,22,13,23],[13,24,13,25],[13,26,13,27],[13,4,13,5],[13,6,13,7],[13,8,13,9],[13,10,13,11],[13,12,13,13],[13,14,13,15],[13,16,13,17],[14,18,14,19],[14,20,14,21],[14,22,14,23],[14,24,14,25],[14,26,14,27],[14,4,14,5],[14,6,14,7],[14,8,14,9],[14,10,14,11],[14,12,14,13],[14,14,14,15],[14,16,14,17],[15,18,15,19],[15,20,15,21],[15,22,15,23],[15,24,15,25],[15,26,15,27],[15,4,15,5],[15,6,15,7],[15,8,15,9],[15,10,15,11],[15,12,15,13],[15,14,15,15],[15,16,15,17],[23,18,23,19],[23,20,23,21],[23,22,23,23],[23,24,23,25],[23,26,23,27],[23,4,23,5],[23,6,23,7],[23,8,23,9],[23,10,23,11],[23,12,23,13],[23,14,23,15],[23,16,23,17],[7,18,7,19],[7,20,7,21],[7,22,7,23],[7,24,7,25],[7,26,7,27],[7,4,7,5],[7,6,7,7],[7,8,7,9],[7,10,7,11],[7,12,7,13],[7,14,7,15],[7,16,7,17],[8,18,8,19],[8,20,8,21],[8,22,8,23],[8,24,8,25],[8,26,8,27],[8,4,8,5],[8,6,8,7],[8,8,8,9],[8,10,8,11],[8,12,8,13],[8,14,8,15],[8,16,8,17],[9,18,9,19],[9,20,9,21],[9,22,9,23],[9,24,9,25],[9,26,9,27],[9,4,9,5],[9,6,9,7],[9,8,9,9],[9,10,9,11],[9,12,9,13],[9,14,9,15],[9,16,9,17],[25,18,25,19],[25,20,25,21],[25,22,25,23],[25,24,25,25],[25,26,25,27],[25,4,25,5],[25,6,25,7],[25,8,25,9],[25,10,25,11],[25,12,25,13],[25,14,25,15],[25,16,25,17],[50,16,50,17],[50,18,50,19],[50,20,50,21],[50,22,50,23],[50,24,50,25],[50,26,50,27],[43,31,43,40],[44,31,44,40],[50,1,50,2],[50,4,50,5],[50,6,50,7],[50,8,50,9],[50,10,50,11],[50,28,50,29],[24,18,24,19],[24,20,24,21],[24,22,24,23],[24,24,24,25],[24,26,24,27],[24,4,24,5],[24,6,24,7],[24,8,24,9],[24,10,24,11],[24,12,24,13],[24,14,24,15],[24,16,24,17],[27,1,27,2],[27,4,27,5],[27,6,27,7],[27,8,27,9],[27,10,27,11],[27,12,27,13],[27,14,27,15],[27,16,27,17],[27,18,27,19],[27,20,27,21],[27,22,27,23],[27,24,27,25],[27,26,27,27],[27,28,27,29],[29,31,29,40],[30,31,30,40],[31,31,31,40],[32,31,32,40],[33,31,33,40],[34,31,34,40],[35,31,35,40],[36,31,36,40],[37,31,37,40],[38,31,38,40],[39,31,39,40],[40,31,40,40],[41,31,41,40],[42,31,42,40],[50,12,50,13],[50,14,50,15],[16,18,16,19],[16,20,16,21],[16,22,16,23],[16,24,16,25],[16,26,16,27],[16,4,16,5],[16,6,16,7],[16,8,16,9],[16,10,16,11],[16,12,16,13],[16,14,16,15],[16,16,16,17],[17,18,17,19],[17,20,17,21],[17,22,17,23],[17,24,17,25],[17,26,17,27],[17,4,17,5],[17,6,17,7],[17,8,17,9],[17,10,17,11],[17,12,17,13],[17,14,17,15],[17,16,17,17],[18,18,18,19],[18,20,18,21],[18,22,18,23],[18,24,18,25],[18,26,18,27],[18,4,18,5],[18,6,18,7],[18,8,18,9],[18,10,18,11],[18,12,18,13],[18,14,18,15],[18,16,18,17],[19,18,19,19],[19,20,19,21],[19,22,19,23],[19,24,19,25],[19,26,19,27],[19,4,19,5],[19,6,19,7],[19,8,19,9],[19,10,19,11],[19,12,19,13],[19,14,19,15],[19,16,19,17],[20,18,20,19],[20,20,20,21],[20,22,20,23],[20,24,20,25],[20,26,20,27],[20,4,20,5],[20,6,20,7],[20,8,20,9],[20,10,20,11],[20,12,20,13],[20,14,20,15],[20,16,20,17],[21,18,21,19],[21,20,21,21],[21,22,21,23],[21,24,21,25],[21,26,21,27],[21,4,21,5],[21,6,21,7],[21,8,21,9],[21,10,21,11],[21,12,21,13],[21,14,21,15],[21,16,21,17],[22,18,22,19],[22,20,22,21],[22,22,22,23],[22,24,22,25],[22,26,22,27],[22,4,22,5],[22,6,22,7],[22,8,22,9],[22,10,22,11],[22,12,22,13],[22,14,22,15],[22,16,22,17]]}
[{"$f":"CurrentVersion","v":"v6.02"},null,null,null,"Highlight Color Legend"]
[null,"MITDP PCA Code(s) ","override",null,"Title/Header",null,"Calculated but Editable",null,"Calculated/not editable",null,"Manual Entry"]
[null,"SPEND PLAN"]
[null,"Spend Plan as of:",{"$f":"Reporting_Month","v":"Jul/FY23"}]
[null,{"$f":"\"FY\"&FISCAL_START&\" BASELINE Spend Plan\"","v":"FY23 BASELINE Spend Plan"},null,null,"July",null,"August",null,"September",null,"October",null,"November",null,"December",null,"January",null,"February",null,"March",null,"April",null,"May",null,"June",null,null,null,null,{"$f":"\"FY\"&FISCAL_START+1&\" BASELINE Spend Plan\"","v":"FY24 BASELINE Spend Plan"},null,null,{"$f":"\"20\"&FISCAL_START","v":"2023"},{"$f":"\"20\"&FISCAL_START","v":"2023"},{"$f":"\"20\"&FISCAL_START","v":"2023"},{"$f":"\"20\"&FISCAL_START","v":"2023"},{"$f":"\"20\"&FISCAL_START","v":"2023"},{"$f":"\"20\"&FISCAL_START","v":"2023"},{"$f":"\"20\"&FISCAL_START+1","v":"2024"},{"$f":"\"20\"&FISCAL_START+1","v":"2024"},{"$f":"\"20\"&FISCAL_START+1","v":"2024"},{"$f":"\"20\"&FISCAL_START+1","v":"2024"},{"$f":"\"20\"&FISCAL_START+1","v":"2024"},{"$f":"\"20\"&FISCAL_START+1","v":"2024"}]
[null,"Vendor","Contract ID","Services/Products",{"$f":"E5&\" 20\"&FISCAL_START-1","v":"July 2022"},null,{"$f":"G5&\" 20\"&FISCAL_START-1","v":"August 2022"},null,{"$f":"I5&\" 20\"&FISCAL_START-1","v":"September 2022"},null,{"$f":"K5&\" 20\"&FISCAL_START-1","v":"October 2022"},null,{"$f":"M5&\" 20\"&FISCAL_START-1","v":"November 2022"},null,{"$f":"O5&\" 20\"&FISCAL_START-1","v":"December 2022"},null,{"$f":"Q5&\" 20\"&FISCAL_START","v":"January 2023"},null,{"$f":"S5&\" 20\"&FISCAL_START","v":"February 2023"},null,{"$f":"U5&\" 20\"&FISCAL_START","v":"March 2023"},null,{"$f":"W5&\" 20\"&FISCAL_START","v":"April 2023"},null,{"$f":"Y5&\" 20\"&FISCAL_START","v":"May 2023"},null,{"$f":"AA5&\" 20\"&FISCAL_START","v":"June 2023"},null,"Total",null,null,"Vendor","Contract ID","Services/Products","July","August","September","October","November","December","January","February","March","April","May","June","Total"]
[null,"Vendor 1",{"$f":"IF(ISBLANK('5) Contract Management'!E3),\"\",'5) Contract Management'!E3)","v":""},{"$f":"IF(ISBLANK('5) Contract Management'!D3),\"\",'5) Contract Management'!D3)","v":""},0.0,null,0.0,null,0.0,null,0.0,null,0.0,null,0.0,null,0.0,null,0.0,null,0.0,null,0.0,null,0.0,null,0.0,null,{"$f":"SUM(E7:AB7)","v":0},null,null,{"$f":"IF(ISBLANK($B7),\"\",$B7)","v":"Vendor 1"},{"$f":"IF(ISBLANK($C7),\"\",$C7)","v":""},{"$f":"IF(ISBLANK($D7),\"\",$D7)","v":""},0.0,0.0,0.0,0.0,0.0,0.0,0.0,0.0,0.0,0.0,0.0,0.0,{"$f":"SUM(AI7:AT7)","v":0}]
[null,"Vendor 2",{"$f":"IF(ISBLANK('5) Contract Management'!E4),\"\",'5) Contract Management'!E4)","v":""},{"$f":"IF(ISBLANK('5) Contract Management'!D4),\"\",'5) Contract Management'!D4)","v":""},0.0,null,0.0,null,0.0,null,0.0,null,0.0,null,0.0,null,0.0,null,0.0,null,0.0,null,0.0,null,0.0,null,0.0,null,0,null,null,"Vendor 2","","",0.0,0.0,0.0,0.0,0.0,0.0,0.0,0.0,0.0,0.0,0.0,0.0,0]
{"$rows_left_out":65}
{"sheet":"4) Milestones","index":3,"n_rows":17,"n_cols":6,"rows_kept":17,"cut":false,"hidden":false,"merged":[[1,1,1,16]]}
[{"$f":"CurrentVersion","v":"v6.02"}]
[null,"Project Milestones"]
[]
[null,null,"Milestones and Feature Completion","Baseline/Plan","Actual","Status"]
[null,null,"Project Initiation","[Month/FY]","[Month/FY]"]
[null,null,"PPR","[Month/FY]","[Month/FY]"]
[null,null,"PIR","[Month/FY]","[Month/FY]"]
[null,null,"Requirements Gathering","[Month/FY]","[Month/FY]"]
{"$rows_left_out":10}
{"sheet":"5) Contract Management","index":4,"n_rows":22,"n_cols":26,"rows_kept":22,"cut":false,"hidden":false,"merged":[[0,7,1,7],[0,8,1,8],[0,9,1,9],[0,10,1,10],[0,11,1,11],[0,12,1,12],[0,13,1,13],[0,24,1,24],[0,0,1,0],[0,1,1,1],[0,2,1,2],[0,3,1,3],[0,4,1,4],[0,5,1,5],[0,6,1,6]]}
["No","Project/Subproject","Vendor/Service Provider","Service(s)/Product(s)","Contract ID","Contract Description/WO Name","Vehicle Type","Contract Type","Solicitation ID","Notes","Contract Term","Contract Start Date","Contract End Date","NTE/Total Contract Amount","Year 1 Amount","Year 2 Amount","Year 3 Amount","Year 4 Amount","Year 5 Amount","Year 6 Amount","Year 7 Amount","Year 8 Amount","Year 9 Amount","Year 10 Amount","Total"]
[null,null,null,null,null,null,null,null,null,null,null,null,null,null,"Base","NA","NA","NA","NA","NA","NA","NA","NA","NA"]
[1.0,{"$f":"Project_Name","v":"[Project Name]"},"Vendor 1",null,null,null,null,null,null,null,null,null,null,0.0,0.0,0.0,0.0,0.0,0.0,0.0,0.0,0.0,0.0,0.0,{"$f":"SUM(O3:X3)","v":0},{"$f":"IF(Y3<>N3,\"Error - NTE amount does not match Year Totals\",\"\")","v":""}]
[2.0,{"$f":"Project_Name","v":"[Project Name]"},"Vendor 2",null,null,null,null,null,null,null,null,null,null,0.0,0.0,0.0,0.0,0.0,0.0,0.0,0.0,0.0,0.0,0.0,0,""]
[3.0,{"$f":"Project_Name","v":"[Project Name]"},"Vendor 3",null,null,null,null,null,null,null,null,null,null,0.0,0.0,0.0,0.0,0.0,0.0,0.0,0.0,0.0,0.0,0.0,0,""]
[4.0,{"$f":"Project_Name","v":"[Project Name]"},"Vendor 4",null,null,null,null,null,null,null,null,null,null,0.0,0.0,0.0,0.0,0.0,0.0,0.0,0.0,0.0,0.0,0.0,0,""]
[5.0,{"$f":"Project_Name","v":"[Project Name]"},"Vendor 5",null,null,null,null,null,null,null,null,null,null,0.0,0.0,0.0,0.0,0.0,0.0,0.0,0.0,0.0,0.0,0.0,0,""]
[6.0,{"$f":"Project_Name","v":"[Project Name]"},"Vendor 6",null,null,null,null,null,null,null,null,null,null,0.0,0.0,0.0,0.0,0.0,0.0,0.0,0.0,0.0,0.0,0.0,0,""]
{"$rows_left_out":15}
{"sheet":"RiskStrategyDefinitions","index":5,"n_rows":9,"n_cols":3,"rows_kept":9,"cut":false,"hidden":false,"merged":[]}
[{"$f":"CurrentVersion","v":"v6.02"}]
[null,"RISK STRATEGY DEFINITIONS"]
[]
[null,null,"Strategies for Risks\n"]
[null,null,"By way of example, imagine that you're planning to go on a vacation in Asia.  Here are some of the common risks that might take place and your possible responses to these.  There are four risk response strategies for negative risks:"]
[null,null,"Avoidance - avoiding a risk means reducing the probability of it happening to zero. Usually, this includes making some adjustments to the original project plan. For example, let's say that you're warned by your travel agent about an increased risk of malaria in Cambodia, so you decide not to go there at all and visit Vietnam instead."]
[null,null,"Transferring - transferring a risk means shifting the responsibility for dealing with risk event consequences to someone else. For example, in case you're worried that your luggage will be lost during the flight, you can purchase travel insurance, so that in the event of the luggage actually being lost, the risk will be transferred to the insurance company, from whom you would receive compensation."]
[null,null,"Mitigation - mitigating a risk means reducing the impact of a risk event on your project. For example, you might be planning to travel to the airport by train, but will also research alternative options in case there are planned rail works on the day of your travel."]
{"$rows_left_out":2}
{"sheet":"DeliverablesTracking","index":6,"n_rows":26,"n_cols":7,"rows_kept":26,"cut":false,"hidden":false,"merged":[[1,0,1,6],[25,0,25,2]]}
[{"$f":"CurrentVersion","v":"v6.02"}]
["DELIVERABLES TRACKING"]
[null,"Planning Deliverables",null,"Deliverable Uploaded","Plan to Create By","No Plan to Create","OPM Assessment/Comments"]
[null,null,"Project Charter"]
[null,null,"Project Management Plan"]
[null,null,"Solutions Roadmap"]
[null,null,"Responsibility Assignment Matrix"]
[null,null,"Non-Functional Requirements"]
{"$rows_left_out":19}
{"sheet":"OPM Assessment","index":7,"n_rows":12,"n_cols":7,"rows_kept":12,"cut":false,"hidden":false,"merged":[[1,1,1,5]]}
[{"$f":"CurrentVersion","v":"v6.02"}]
[null,"OPM Assessment"]
[null,"This tab is for OPM USE ONLY."]
[]
[null,null,null,"Project PM Reported","OPM Assessment","Justification"]
[null,null,"Overall Status",{"$f":"Rating_Overall","v":"ERROR"},"Select One  >",null,{"$f":"IF(OPM_Rating_Overall=0,0,IF(AND(Rating_Overall<>OPM_Rating_Overall,ISBLANK(F6)),1,0))","v":1}]
[null,null,"Scope",{"$f":"Rating_Scope","v":"ERROR"},"Select One  >",null,{"$f":"IF(OPM_Rating_Scope=0,0,IF(AND(Rating_Scope<>OPM_Rating_Scope,ISBLANK(F7)),1,0))","v":1}]
[null,null,"Schedule",{"$f":"Rating_Schedule","v":"ERROR"},"Select One  >",null,{"$f":"IF(OPM_Rating_Schedule=0,0,IF(AND(Rating_Schedule<>OPM_Rating_Schedule,ISBLANK(F8)),1,0))","v":1}]
{"$rows_left_out":5}
{"sheet":"LOOKUPS","index":8,"n_rows":78,"n_cols":28,"rows_kept":78,"cut":false,"hidden":false,"merged":[]}
[1.0,null,null,"SET FISCAL YEAR",23.0,null,"Reporting_Period",null,null,"Risk Strategies","SpendPlan Choices","ContractYearType","VehicleType","ContractType","Current Version",{"$f":"\"v\"&LOOKUP(2,1/(P5:P26<>\"\"),P5:P26)","v":"v6.02"}]
["Select One  >",0.0,null,null,null,null,"Jun/FY22",null,null,"Avoid","Forecast","Base","RFP","Firm Fixed Price",null,null,null,null,null,null,"ID","CHANGE","Status",null,"Highlight Color Legend"]
[" - Yes",1.0,null,null,null,null,null,null,null,"Transfer","Incurred","Option","TORFP","T&M",null,null,null,null,null,null,1.0,"Submitted BA","Complete",null,"Title/Header","Calculated but editable","Calculated/not editable","Manual Entry"]
[" - No, but we are in the process of creating, or seeking approval, for one.",2.0,null,null,null,null,"Jul/FY23",null,null,"Mitigate",null,"NA","PORFP/Purchase Order","Other","Change Log","ID","Name","Changes","Date",null,2.0,"Submitted Invoices","Postpone for now"]
[" - No, we have no plan or are unable to create one.",3.0,null,null,null,null,"Aug/FY23",null,null,"Accept",null,null,"Work Order",null,null,3.0,"JoeV","Revised template, supersedes V2.x",null,null,3.0,"PCA - does it have one?","Complete"]
[2.0,null,null,null,null,null,"Sep/FY23",null,null,null,null,null,"MOU",null,null,3.1,"JoeV","Fixed some spelling errors.",null,null,4.0,"Procurements Tab (ashley has draft) - \"Contract Management\"","Complete"]
["Select One  >",0.0,null,null,null,null,"Oct/FY23",null,null,null,null,null,"Other",null,null,3.2,"JoeV","Fixed missing FY formulas on Spend Plan tab B34 and B49\nAdded Start/End date columns to Milestones table on Milestones tab\nAdded RiskStrategy lookup for HealthAssessment tab H17:H23\nHid OPM Assessment and Deliverables tab as these are now tracked in Workbooks.",null,null,5.0,"Encumbrances on funding","Postpone for now"]
[" - Yes",1.0,null,null,null,null,"Nov/FY23",null,null,null,null,null,null,null,null,3.3,"JoeV","Added VBA to lock/unlock all sheets and workbook.  Changed Actuals table on Spend Plan tab to estimate oversight actuals for the year based on baseline plan.  ","2020-09-02",null,6.0,"On reporting month dropdown change pop up message saying \"Please review questionnaire responses…\"","Complete"]
{"$rows_left_out":71}
{"sheet":"EvaluationCriteria","index":9,"n_rows":8,"n_cols":4,"rows_kept":8,"cut":false,"hidden":true,"merged":[]}
["Health Status","Green\n(Controlled)","Yellow\n(Caution)","Red\n(Critical)"]
["Scope","The project has a well documented and approved project scope [such that it can be leveraged in the RFP(s)] that will meet the intentions of the project charter \n- AND - \nThe project has an actively managed backlog/list of features/specification/requirements to be developed/delivered in accordance with DoIT's SDLC principles, and in keeping with agile methods, tools, and techniques.","The project is in the process of developing, or seeking approval for, a well documented project scope [such that it can be leveraged in the RFP(s)] that will meet the intentions of the project charter \n- OR - \nThe project is assembling a backlog/list of features/specification/requirements to be developed/delivered in accordance with DoIT's SDLC principles, and in keeping with agile methods, tools, and techniques that will be actively managed \n- OR - \nNew scope has been identified that must be added to the original scope in order to deliver a minimally viable product.","The project does not have a well documented/approved project scope [such that it can be leveraged in the RFP(s)] that will meet the intentions of the project charter and has no plans to create one \n- OR - \nThe project has not assembled a backlog/list of features/specification/requirements and has no plans to create one \n- OR- \nThe project will not be developed/delivered in accordance with DoIT's SDLC principles, and in keeping with agile methods, tools, and techniques."]
["Schedule","The project has an approved project schedule which identifies, at a minimum, critical path tasks, milestones and or deliverables.  \n- AND -\nThe critical path tasks, milestones and or deliverables are being completed as scheduled or are estimated to be completed on time.","The project is in the process of developing, or seeking approval for, a project schedule which identifies, at a minimum, critical path tasks, milestones and or deliverables.  \n- OR -\nThe critical path tasks, milestones and or deliverables are behind schedule but the project is seeking approval to rebaseline.","The project does not have an approved project schedule and has no plans to create one.\n- OR -\nThe critical path tasks, milestones and or deliverables are behind schedule with no plan to seek approval to rebaseline.\n- OR -\nThe critical path tasks, milestones and or deliverables are behind schedule and there is no ability to remedy."]
["Costs","The project has an approved budget\n- AND -\nthe estimated cost at completion is less than or equal to budgeted cost at completion \n- AND -\nthe project is trending to complete on or below the approved budget and spend plan\n- AND -\nthe project is recording costs against the project, at least, monthly.","The project is in the process of assembling, or seeking approval for, a project budget\n-OR -\nthe estimated cost at completion is greater than or equal to budgeted cost at completion but a plan is in place to correct spending or submit an Over the Target request \n- OR -\nestimating costs for future sprints are unclear\n- OR -\nthe project is not recording costs against the project, at least, monthly.","The project does not have an approved project budget and has no plans to create one\n-OR -\nthe estimated cost at completion is greater than the budgeted cost at completion and does not plan to submit an Over the Target request \n- OR -\nthe project is not recording costs against the project, at least, monthly and has no plan to do so."]
["Risk / Issues","The project has an approved Risk Management Plan in place that incorporates a Risk Register which 1) identifies risk Impact and Probability AND 2) documents the appropriate risk response strategy(ies) (avoidance, transference, mitigation, acceptance)\n- AND -\nthe project Risk Register is periodically reviewed and updated as appropriate.","The project is in the process of assembling, or seeking approval for, a Risk Management Plan that incorporates a Risk Register which 1) identifies risk Impact and Probability AND 2) documents the appropriate risk response strategy(ies) (avoidance, transference, mitigation, acceptance).","The project does not have an approved Risk Management Plan in place and has no plans to create one."]
["Quality","The project has an approved Quality Management Plan or Quality processes (as defined in the PMBOK) in place;\n- AND -\nthe project is in compliance with its approved Quality Management Plan or Quality processes.","The project is in the process of assembling, or seeking approval for, a Quality Management Plan or Quality processes (as defined in the PMBOK);\n- OR - \nthe project is not in compliance with its approved Quality Management Plan or Quality processes but has a plan in place to remedy.","The project does not have an Quality Management Plan or Quality processes (as defined in the PMBOK) in place and has no plans to create one\n- OR - \nthe project is not in compliance with its approved Quality Management Plan or Quality processes and has no plan in place to remedy."]
["Resources","The project is fully staffed.","Project currently has key personnel/critical role (directly affecting critical path activities) vacancies but project leadership is working to fill/backfill resources","The project currently has key personnel/critical (directly affecting critical path activities) vacancies and does not have a plan to/are unable to fill the vacancies."]
["Health Status","Green\n(Controlled)","Yellow\n(Caution)","Red\n(Critical)"]