{"text_format":"1","workbook":"xlsx","n_sheets":4,"sheets":["Cover Sheet","1 - INSTRUCTIONS","2 - SUMMARY","3 - REQUIREMENTS"],"not_rendered":{"charts":1,"images":4,"macros":1,"external_links":0,"defined_names":4,"comments":0,"pivot_tables":0},"unopened":[],"bounds":{"document_bytes":16777216,"sheet_cells":100000,"rows_first":2000,"rows_last":500,"rows_between":2000,"halvings":0,"cell_chars":16384,"cell_head_chars":4096},"cells_cut":0,"cells_raw":0,"read":"whole","date_system":"1900"}

{"sheet":"Cover Sheet","index":0,"n_rows":51,"n_cols":1,"rows_kept":51,"cut":false,"hidden":false,"merged":[]}
[]
["NUMBER J02B8400002"]
["ATTACHMENT 18 – MDOT SHA CIS Requirements Document"]
["The remainder of the page is intentionally left blank"]
[]
[]
[]
[]
[]
[]
[]
[]
[]
[]
[]
[]
[]
[]
[]
[]
[]
[]
[]
[]
[]
[]
[]
[]
[]
[]
{"$rows_left_out":22}
{"sheet":"1 - INSTRUCTIONS","index":1,"n_rows":18,"n_cols":7,"rows_kept":18,"cut":false,"hidden":false,"merged":[[5,2,5,5],[10,2,10,3],[7,2,7,5],[8,2,8,5],[1,1,2,5],[6,2,6,5]]}
[null," Consumable Inventory System (CIS) Requirements Document",null,null,null,null,"MDOT SHA CIS Project"]
[null,"Response Codes: Y - Yes, Included; F - Future; C - Customer Configuration; T - TO Contractor Customization; P - Third Party; N - Not Available",null,null,null,null,"NUMBER J02B8400002"]
[]
[]
[null,null,"Instructions:"]
[null,null,"The Offeror shall complete Tab \"3 - REQUIREMENTS\" to indicate its understanding of each requirement and its inclusion in its response. Use the codes provided in Table 1 below to fill in the Response column in Tab \"3 - REQUIREMENTS\". For codes F, V, and T, provide any requested information from Table 1 in the Comments column of Tab \"3 - REQUIREMENTS\"."]
[null,null,"The proposed solution shall meet, at minimum, all requirements stated as “The CIS shall…” Any requirements stated as “The CIS may…” are preferred requirements."]
[null,null,"Only respond to requirements with yellow shading.  Do not respond to requirements without yellow shading. Sections 1.17.21, 1.22, and 1.23 do not have yellow shading because they are assumed to be TO Contractor Customization for all Offerors."]
[null,null,"Any requirement with yellow shading to which there is no response will be considered as not available as a part of the Solution."]
[]
[null,null,"Table 1. Requirements Response Code Legend."]
[null,null,"Response Code","Description"]
[null,null,"Y","Yes, Included: Feature is delivered as standard functionality in the proposed version of the Solution."]
[null,null,"F","Future: Feature is not currently included but will be available in a future release.  Indicate time frame (e.g. 12 months)."]
[null,null,"C","Customer Configuration: Tools are provided to configure at no additional cost. (No customer development needed.)"]
[null,null,"T","TO Contractor Customization: Not included. TO Contractor provides customization with additional code development. Indicate an estimated level of effort for customization."]
[null,null,"P","Third Party: Feature is provided by a third party partnering arrangement.  Indicate any preferred partner agreements."]
[null,null,"N","Not available."]

{"sheet":"2 - SUMMARY","index":2,"n_rows":11,"n_cols":9,"rows_kept":11,"cut":false,"hidden":false,"merged":[[1,1,2,7],[3,1,3,7]]}
[null," Consumable Inventory System (CIS) Requirements Document",null,null,null,null,null,null,"MDOT SHA CIS Project"]
[null,"Response Codes: Y - Yes, Included; F - Future; C - Customer Configuration; T - TO Contractor Customization; P - Third Party; N - Not Available",null,null,null,null,null,null,"NUMBER J02B8400002"]
[]
["Offeror Name:",{"$f":"IF('3 - REQUIREMENTS'!B1:E1=\"\",\"Enter Offeror Name on Tab '3 - REQUIREMENTS'\",'3 - REQUIREMENTS'!B1:E1)","v":"Enter Offeror Name on Tab '3 - REQUIREMENTS'"}]
[null,null,null,"Responses:"]
[null,null,null,"Yes, Included - Y:",{"$f":"COUNTIF('3 - REQUIREMENTS'!G3:G2992,\"=Y\")","v":0}]
[null,null,null,"Future - F:",{"$f":"COUNTIF('3 - REQUIREMENTS'!G3:G2992,\"=F\")","v":0}]
[null,null,null,"Customer Configuration - C:",{"$f":"COUNTIF('3 - REQUIREMENTS'!G3:G2992,\"=C\")","v":0}]
[null,null,null,"TO Contractor Customization - T:",{"$f":"COUNTIF('3 - REQUIREMENTS'!G3:G2992,\"=T\")","v":0}]
[null,null,null,"Third Party - P:",{"$f":"COUNTIF('3 - REQUIREMENTS'!G3:G2992,\"=P\")","v":0}]
[null,null,null,"Not Available - N:",{"$f":"COUNTIF('3 - REQUIREMENTS'!G3:G2992,\"=N\")","v":0}]

{"sheet":"3 - REQUIREMENTS","index":3,"n_rows":2992,"n_cols":9,"rows_kept":2992,"cut":false,"hidden":false,"merged":[[2968,1,2968,4],[2969,1,2969,4],[2970,1,2970,4],[2971,1,2971,4],[2972,1,2972,4],[2973,1,2973,4],[2962,1,2962,4],[2963,1,2963,4],[2986,1,2986,4],[2987,1,2987,4],[2988,1,2988,4],[2989,1,2989,4],[2990,1,2990,4],[2991,1,2991,4],[2980,1,2980,4],[2981,1,2981,4],[2982,1,2982,4],[2983,1,2983,4],[2984,1,2984,4],[2985,1,2985,4],[2974,1,2974,4],[2975,1,2975,4],[2976,1,2976,4],[2977,1,2977,4],[2978,1,2978,4],[2979,1,2979,4],[2964,1,2964,4],[2965,1,2965,4],[2966,1,2966,4],[2967,1,2967,4],[2950,1,2950,4],[2951,1,2951,4],[2952,1,2952,4],[2953,1,2953,4],[2954,1,2954,4],[2955,1,2955,4],[2944,1,2944,4],[2945,1,2945,4],[2946,1,2946,4],[2947,1,2947,4],[2948,1,2948,4],[2949,1,2949,4],[2938,1,2938,4],[2939,1,2939,4],[2940,1,2940,4],[2941,1,2941,4],[2942,1,2942,4],[2943,1,2943,4],[2956,1,2956,4],[2957,1,2957,4],[2958,1,2958,4],[2959,1,2959,4],[2960,1,2960,4],[2961,1,2961,4],[2932,1,2932,4],[2933,1,2933,4],[2934,1,2934,4],[2935,1,2935,4],[2936,1,2936,4],[2937,1,2937,4],[2926,1,2926,4],[2927,1,2927,4],[2928,1,2928,4],[2929,1,2929,4],[2930,1,2930,4],[2931,1,2931,4],[2920,1,2920,4],[2921,1,2921,4],[2922,1,2922,4],[2923,1,2923,4],[2924,1,2924,4],[2925,1,2925,4],[2914,1,2914,4],[2915,1,2915,4],[2916,1,2916,4],[2917,1,2917,4],[2918,1,2918,4],[2919,1,2919,4],[2908,1,2908,4],[2909,1,2909,4],[2910,1,2910,4],[2911,1,2911,4],[2912,1,2912,4],[2913,1,2913,4],[2902,1,2902,4],[2903,1,2903,4],[2904,1,2904,4],[2905,1,2905,4],[2906,1,2906,4],[2907,1,2907,4],[2896,1,2896,4],[2897,1,2897,4],[2898,1,2898,4],[2899,1,2899,4],[2900,1,2900,4],[2901,1,2901,4],[2890,1,2890,4],[2891,1,2891,4],[2892,1,2892,4],[2893,1,2893,4],[2894,1,2894,4],[2895,1,2895,4],[2884,1,2884,4],[2885,1,2885,4],[2886,1,2886,4],[2887,1,2887,4],[2888,1,2888,4],[2889,1,2889,4],[2878,1,2878,4],[2879,1,2879,4],[2880,1,2880,4],[2881,1,2881,4],[2882,1,2882,4],[2883,1,2883,4],[2872,1,2872,4],[2873,1,2873,4],[2874,1,2874,4],[2875,1,2875,4],[2876,1,2876,4],[2877,1,2877,4],[2836,1,2836,4],[2837,1,2837,4],[2868,1,2868,4],[2869,1,2869,4],[2870,1,2870,4],[2871,1,2871,4],[2830,1,2830,4],[2831,1,2831,4],[2832,1,2832,4],[2833,1,2833,4],[2834,1,2834,4],[2835,1,2835,4],[2824,1,2824,4],[2825,1,2825,4],[2826,1,2826,4],[2827,1,2827,4],[2828,1,2828,4],[2829,1,2829,4],[2818,1,2818,4],[2819,1,2819,4],[2820,1,2820,4],[2821,1,2821,4],[2822,1,2822,4],[2823,1,2823,4],[2812,1,2812,4],[2813,1,2813,4],[2814,1,2814,4],[2815,1,2815,4],[2816,1,2816,4],[2817,1,2817,4],[2806,1,2806,4],[2807,1,2807,4],[2808,1,2808,4],[2809,1,2809,4],[2810,1,2810,4],[2811,1,2811,4],[2800,1,2800,4],[2801,1,2801,4],[2802,1,2802,4],[2803,1,2803,4],[2804,1,2804,4],[2805,1,2805,4],[2794,1,2794,4],[2795,1,2795,4],[2796,1,2796,4],[2797,1,2797,4],[2798,1,2798,4],[2799,1,2799,4],[2788,1,2788,4],[2789,1,2789,4],[2790,1,2790,4],[2791,1,2791,4],[2792,1,2792,4],[2793,1,2793,4],[2782,1,2782,4],[2783,1,2783,4],[2784,1,2784,4],[2785,1,2785,4],[2786,1,2786,4],[2787,1,2787,4],[2776,1,2776,4],[2777,1,2777,4],[2778,1,2778,4],[2779,1,2779,4],[2780,1,2780,4],[2781,1,2781,4],[2770,1,2770,4],[2771,1,2771,4],[2772,1,2772,4],[2773,1,2773,4],[2774,1,2774,4],[2775,1,2775,4],[2764,1,2764,4],[2765,1,2765,4],[2766,1,2766,4],[2767,1,2767,4],[2768,1,2768,4],[2769,1,2769,4],[2758,1,2758,4],[2759,1,2759,4],[2760,1,2760,4],[2761,1,2761,4],[2762,1,2762,4],[2763,1,2763,4],[2752,1,2752,4],[2753,1,2753,4],[2754,1,2754,4],[2755,1,2755,4],[2756,1,2756,4],[2757,1,2757,4],[2746,1,2746,4],[2747,1,2747,4],[2748,1,2748,4],[2749,1,2749,4],[2750,1,2750,4],[2751,1,2751,4],[2740,1,2740,4],[2741,1,2741,4],[2742,1,2742,4],[2743,1,2743,4],[2744,1,2744,4],[2745,1,2745,4],[2734,1,2734,4],[2735,1,2735,4],[2736,1,2736,4],[2737,1,2737,4],[2738,1,2738,4],[2739,1,2739,4],[2728,1,2728,4],[2729,1,2729,4],[2730,1,2730,4],[2731,1,2731,4],[2732,1,2732,4],[2733,1,2733,4],[2722,1,2722,4],[2723,1,2723,4],[2724,1,2724,4],[2725,1,2725,4],[2726,1,2726,4],[2727,1,2727,4],[2716,1,2716,4],[2717,1,2717,4],[2718,1,2718,4],[2719,1,2719,4],[2720,1,2720,4],[2721,1,2721,4],[2710,1,2710,4],[2711,1,2711,4],[2712,1,2712,4],[2713,1,2713,4],[2714,1,2714,4],[2715,1,2715,4],[2704,1,2704,4],[2705,1,2705,4],[2706,1,2706,4],[2707,1,2707,4],[2708,1,2708,4],[2709,1,2709,4],[2689,1,2689,4],[2693,1,2693,4],[2694,1,2694,4],[2695,1,2695,4],[2702,1,2702,4],[2703,1,2703,4],[2683,1,2683,4],[2684,1,2684,4],[2685,1,2685,4],[2686,1,2686,4],[2687,1,2687,4],[2688,1,2688,4],[2677,1,2677,4],[2678,1,2678,4],[2679,1,2679,4],[2680,1,2680,4],[2681,1,2681,4],[2682,1,2682,4],[2671,1,2671,4],[2672,1,2672,4],[2673,1,2673,4],[2674,1,2674,4],[2675,1,2675,4],[2676,1,2676,4],[2665,1,2665,4],[2666,1,2666,4],[2667,1,2667,4],[2668,1,2668,4],[2669,1,2669,4],[2670,1,2670,4],[2659,1,2659,4],[2660,1,2660,4],[2661,1,2661,4],[2662,1,2662,4],[2663,1,2663,4],[2664,1,2664,4],[2653,1,2653,4],[2654,1,2654,4],[2655,1,2655,4],[2656,1,2656,4],[2657,1,2657,4],[2658,1,2658,4],[2634,1,2634,4],[2635,1,2635,4],[2636,1,2636,4],[2637,1,2637,4],[2638,1,2638,4],[2646,1,2646,4],[2628,1,2628,4],[2629,1,2629,4],[2630,1,2630,4],[2631,1,2631,4],[2632,1,2632,4],[2633,1,2633,4],[2622,1,2622,4],[2623,1,2623,4],[2624,1,2624,4],[2625,1,2625,4],[2626,1,2626,4],[2627,1,2627,4],[2616,1,2616,4],[2617,1,2617,4],[2618,1,2618,4],[2619,1,2619,4],[2620,1,2620,4],[2621,1,2621,4],[2610,1,2610,4],[2611,1,2611,4],[2612,1,2612,4],[2613,1,2613,4],[2614,1,2614,4],[2615,1,2615,4],[2604,1,2604,4],[2605,1,2605,4],[2606,1,2606,4],[2607,1,2607,4],[2608,1,2608,4],[2609,1,2609,4],[2598,1,2598,4],[2599,1,2599,4],[2600,1,2600,4],[2601,1,2601,4],[2602,1,2602,4],[2603,1,2603,4],[2587,1,2587,4],[2588,1,2588,4],[2589,1,2589,4],[2590,1,2590,4],[2591,1,2591,4],[2592,1,2592,4],[2581,1,2581,4],[2582,1,2582,4],[2583,1,2583,4],[2584,1,2584,4],[2585,1,2585,4],[2586,1,2586,4],[2575,1,2575,4],[2576,1,2576,4],[2577,1,2577,4],[2578,1,2578,4],[2579,1,2579,4],[2580,1,2580,4],[2569,1,2569,4],[2570,1,2570,4],[2571,1,2571,4],[2572,1,2572,4],[2573,1,2573,4],[2574,1,2574,4],[2563,1,2563,4],[2564,1,2564,4],[2565,1,2565,4],[2566,1,2566,4],[2567,1,2567,4],[2568,1,2568,4],[2557,1,2557,4],[2558,1,2558,4],[2559,1,2559,4],[2560,1,2560,4],[2561,1,2561,4],[2562,1,2562,4],[2551,1,2551,4],[2552,1,2552,4],[2553,1,2553,4],[2554,1,2554,4],[2555,1,2555,4],[2556,1,2556,4],[2545,1,2545,4],[2546,1,2546,4],[2547,1,2547,4],[2548,1,2548,4],[2549,1,2549,4],[2550,1,2550,4],[2539,1,2539,4],[2540,1,2540,4],[2541,1,2541,4],[2542,1,2542,4],[2543,1,2543,4],[2544,1,2544,4],[2533,1,2533,4],[2534,1,2534,4],[2535,1,2535,4],[2536,1,2536,4],[2537,1,2537,4],[2538,1,2538,4],[2527,1,2527,4],[2528,1,2528,4],[2529,1,2529,4],[2530,1,2530,4],[2531,1,2531,4],[2532,1,2532,4],[2521,1,2521,4],[2522,1,2522,4],[2523,1,2523,4],[2524,1,2524,4],[2525,1,2525,4],[2526,1,2526,4],[2515,1,2515,4],[2516,1,2516,4],[2517,1,2517,4],[2518,1,2518,4],[2519,1,2519,4],[2520,1,2520,4],[2509,1,2509,4],[2510,1,2510,4],[2511,1,2511,4],[2512,1,2512,4],[2513,1,2513,4],[2514,1,2514,4],[2489,1,2489,4],[2498,1,2498,4],[2505,1,2505,4],[2506,1,2506,4],[2507,1,2507,4],[2508,1,2508,4],[2483,1,2483,4],[2484,1,2484,4],[2485,1,2485,4],[2486,1,2486,4],[2487,1,2487,4],[2488,1,2488,4],[2477,1,2477,4],[2478,1,2478,4],[2479,1,2479,4],[2480,1,2480,4],[2481,1,2481,4],[2482,1,2482,4],[2471,1,2471,4],[2472,1,2472,4],[2473,1,2473,4],[2474,1,2474,4],[2475,1,2475,4],[2476,1,2476,4],[2465,1,2465,4],[2466,1,2466,4],[2467,1,2467,4],[2468,1,2468,4],[2469,1,2469,4],[2470,1,2470,4],[2459,1,2459,4],[2460,1,2460,4],[2461,1,2461,4],[2462,1,2462,4],[2463,1,2463,4],[2464,1,2464,4],[2453,1,2453,4],[2454,1,2454,4],[2455,1,2455,4],[2456,1,2456,4],[2457,1,2457,4],[2458,1,2458,4],[2447,1,2447,4],[2448,1,2448,4],[2449,1,2449,4],[2450,1,2450,4],[2451,1,2451,4],[2452,1,2452,4],[2441,1,2441,4],[2442,1,2442,4],[2443,1,2443,4],[2444,1,2444,4],[2445,1,2445,4],[2446,1,2446,4],[2435,1,2435,4],[2436,1,2436,4],[2437,1,2437,4],[2438,1,2438,4],[2439,1,2439,4],[2440,1,2440,4],[2429,1,2429,4],[2430,1,2430,4],[2431,1,2431,4],[2432,1,2432,4],[2433,1,2433,4],[2434,1,2434,4],[2423,1,2423,4],[2424,1,2424,4],[2425,1,2425,4],[2426,1,2426,4],[2427,1,2427,4],[2428,1,2428,4],[2417,1,2417,4],[2418,1,2418,4],[2419,1,2419,4],[2420,1,2420,4],[2421,1,2421,4],[2422,1,2422,4],[2411,1,2411,4],[2412,1,2412,4],[2413,1,2413,4],[2414,1,2414,4],[2415,1,2415,4],[2416,1,2416,4],[2405,1,2405,4],[2406,1,2406,4],[2407,1,2407,4],[2408,1,2408,4],[2409,1,2409,4],[2410,1,2410,4],[2399,1,2399,4],[2400,1,2400,4],[2401,1,2401,4],[2402,1,2402,4],[2403,1,2403,4],[2404,1,2404,4],[2393,1,2393,4],[2394,1,2394,4],[2395,1,2395,4],[2396,1,2396,4],[2397,1,2397,4],[2398,1,2398,4],[2387,1,2387,4],[2388,1,2388,4],[2389,1,2389,4],[2390,1,2390,4],[2391,1,2391,4],[2392,1,2392,4],[2381,1,2381,4],[2382,1,2382,4],[2383,1,2383,4],[2384,1,2384,4],[2385,1,2385,4],[2386,1,2386,4],[2375,1,2375,4],[2376,1,2376,4],[2377,1,2377,4],[2378,1,2378,4],[2379,1,2379,4],[2380,1,2380,4],[2369,1,2369,4],[2370,1,2370,4],[2371,1,2371,4],[2372,1,2372,4],[2373,1,2373,4],[2374,1,2374,4],[2363,1,2363,4],[2364,1,2364,4],[2365,1,2365,4],[2366,1,2366,4],[2367,1,2367,4],[2368,1,2368,4],[2357,1,2357,4],[2358,1,2358,4],[2359,1,2359,4],[2360,1,2360,4],[2361,1,2361,4],[2362,1,2362,4],[2351,1,2351,4],[2352,1,2352,4],[2353,1,2353,4],[2354,1,2354,4],[2355,1,2355,4],[2356,1,2356,4],[2345,1,2345,4],[2346,1,2346,4],[2347,1,2347,4],[2348,1,2348,4],[2349,1,2349,4],[2350,1,2350,4],[2339,1,2339,4],[2340,1,2340,4],[2341,1,2341,4],[2342,1,2342,4],[2343,1,2343,4],[2344,1,2344,4],[2333,1,2333,4],[2334,1,2334,4],[2335,1,2335,4],[2336,1,2336,4],[2337,1,2337,4],[2338,1,2338,4],[2327,1,2327,4],[2328,1,2328,4],[2329,1,2329,4],[2330,1,2330,4],[2331,1,2331,4],[2332,1,2332,4],[2321,1,2321,4],[2322,1,2322,4],[2323,1,2323,4],[2324,1,2324,4],[2325,1,2325,4],[2326,1,2326,4],[2315,1,2315,4],[2316,1,2316,4],[2317,1,2317,4],[2318,1,2318,4],[2319,1,2319,4],[2320,1,2320,4],[2309,1,2309,4],[2310,1,2310,4],[2311,1,2311,4],[2312,1,2312,4],[2313,1,2313,4],[2314,1,2314,4],[2303,1,2303,4],[2304,1,2304,4],[2305,1,2305,4],[2306,1,2306,4],[2307,1,2307,4],[2308,1,2308,4],[2297,1,2297,4],[2298,1,2298,4],[2299,1,2299,4],[2300,1,2300,4],[2301,1,2301,4],[2302,1,2302,4],[2291,1,2291,4],[2292,1,2292,4],[2293,1,2293,4],[2294,1,2294,4],[2295,1,2295,4],[2296,1,2296,4],[2285,1,2285,4],[2286,1,2286,4],[2287,1,2287,4],[2288,1,2288,4],[2289,1,2289,4],[2290,1,2290,4],[2279,1,2279,4],[2280,1,2280,4],[2281,1,2281,4],[2282,1,2282,4],[2283,1,2283,4],[2284,1,2284,4],[2273,1,2273,4],[2274,1,2274,4],[2275,1,2275,4],[2276,1,2276,4],[2277,1,2277,4],[2278,1,2278,4],[2267,1,2267,4],[2268,1,2268,4],[2269,1,2269,4],[2270,1,2270,4],[2271,1,2271,4],[2272,1,2272,4],[2261,1,2261,4],[2262,1,2262,4],[2263,1,2263,4],[2264,1,2264,4],[2265,1,2265,4],[2266,1,2266,4],[2255,1,2255,4],[2256,1,2256,4],[2257,1,2257,4],[2258,1,2258,4],[2259,1,2259,4],[2260,1,2260,4],[2249,1,2249,4],[2250,1,2250,4],[2251,1,2251,4],[2252,1,2252,4],[2253,1,2253,4],[2254,1,2254,4],[2243,1,2243,4],[2244,1,2244,4],[2245,1,2245,4],[2246,1,2246,4],[2247,1,2247,4],[2248,1,2248,4],[2237,1,2237,4],[2238,1,2238,4],[2239,1,2239,4],[2240,1,2240,4],[2241,1,2241,4],[2242,1,2242,4],[2231,1,2231,4],[2232,1,2232,4],[2233,1,2233,4],[2234,1,2234,4],[2235,1,2235,4],[2236,1,2236,4],[2225,1,2225,4],[2226,1,2226,4],[2227,1,2227,4],[2228,1,2228,4],[2229,1,2229,4],[2230,1,2230,4],[2219,1,2219,4],[2220,1,2220,4],[2221,1,2221,4],[2222,1,2222,4],[2223,1,2223,4],[2224,1,2224,4],[2213,1,2213,4],[2214,1,2214,4],[2215,1,2215,4],[2216,1,2216,4],[2217,1,2217,4],[2218,1,2218,4],[2207,1,2207,4],[2208,1,2208,4],[2209,1,2209,4],[2210,1,2210,4],[2211,1,2211,4],[2212,1,2212,4],[2201,1,2201,4],[2202,1,2202,4],[2203,1,2203,4],[2204,1,2204,4],[2205,1,2205,4],[2206,1,2206,4],[2195,1,2195,4],[2196,1,2196,4],[2197,1,2197,4],[2198,1,2198,4],[2199,1,2199,4],[2200,1,2200,4],[2189,1,2189,4],[2190,1,2190,4],[2191,1,2191,4],[2192,1,2192,4],[2193,1,2193,4],[2194,1,2194,4],[2183,1,2183,4],[2184,1,2184,4],[2185,1,2185,4],[2186,1,2186,4],[2187,1,2187,4],[2188,1,2188,4],[2177,1,2177,4],[2178,1,2178,4],[2179,1,2179,4],[2180,1,2180,4],[2181,1,2181,4],[2182,1,2182,4],[2171,1,2171,4],[2172,1,2172,4],[2173,1,2173,4],[2174,1,2174,4],[2175,1,2175,4],[2176,1,2176,4],[2165,1,2165,4],[2166,1,2166,4],[2167,1,2167,4],[2168,1,2168,4],[2169,1,2169,4],[2170,1,2170,4],[2159,1,2159,4],[2160,1,2160,4],[2161,1,2161,4],[2162,1,2162,4],[2163,1,2163,4],[2164,1,2164,4],[2153,1,2153,4],[2154,1,2154,4],[2155,1,2155,4],[2156,1,2156,4],[2157,1,2157,4],[2158,1,2158,4],[2147,1,2147,4],[2148,1,2148,4],[2149,1,2149,4],[2150,1,2150,4],[2151,1,2151,4],[2152,1,2152,4],[2141,1,2141,4],[2142,1,2142,4],[2143,1,2143,4],[2144,1,2144,4],[2145,1,2145,4],[2146,1,2146,4],[2135,1,2135,4],[2136,1,2136,4],[2137,1,2137,4],[2138,1,2138,4],[2139,1,2139,4],[2140,1,2140,4],[2129,1,2129,4],[2130,1,2130,4],[2131,1,2131,4],[2132,1,2132,4],[2133,1,2133,4],[2134,1,2134,4],[2123,1,2123,4],[2124,1,2124,4],[2125,1,2125,4],[2126,1,2126,4],[2127,1,2127,4],[2128,1,2128,4],[2117,1,2117,4],[2118,1,2118,4],[2119,1,2119,4],[2120,1,2120,4],[2121,1,2121,4],[2122,1,2122,4],[2111,1,2111,4],[2112,1,2112,4],[2113,1,2113,4],[2114,1,2114,4],[2115,1,2115,4],[2116,1,2116,4],[2105,1,2105,4],[2106,1,2106,4],[2107,1,2107,4],[2108,1,2108,4],[2109,1,2109,4],[2110,1,2110,4],[2099,1,2099,4],[2100,1,2100,4],[2101,1,2101,4],[2102,1,2102,4],[2103,1,2103,4],[2104,1,2104,4],[2093,1,2093,4],[2094,1,2094,4],[2095,1,2095,4],[2096,1,2096,4],[2097,1,2097,4],[2098,1,2098,4],[2087,1,2087,4],[2088,1,2088,4],[2089,1,2089,4],[2090,1,2090,4],[2091,1,2091,4],[2092,1,2092,4],[2081,1,2081,4],[2082,1,2082,4],[2083,1,2083,4],[2084,1,2084,4],[2085,1,2085,4],[2086,1,2086,4],[2075,1,2075,4],[2076,1,2076,4],[2077,1,2077,4],[2078,1,2078,4],[2079,1,2079,4],[2080,1,2080,4],[2069,1,2069,4],[2070,1,2070,4],[2071,1,2071,4],[2072,1,2072,4],[2073,1,2073,4],[2074,1,2074,4],[2063,1,2063,4],[2064,1,2064,4],[2065,1,2065,4],[2066,1,2066,4],[2067,1,2067,4],[2068,1,2068,4],[2057,1,2057,4],[2058,1,2058,4],[2059,1,2059,4],[2060,1,2060,4],[2061,1,2061,4],[2062,1,2062,4],[2051,1,2051,4],[2052,1,2052,4],[2053,1,2053,4],[2054,1,2054,4],[2055,1,2055,4],[2056,1,2056,4],[2045,1,2045,4],[2046,1,2046,4],[2047,1,2047,4],[2048,1,2048,4],[2049,1,2049,4],[2050,1,2050,4],[2039,1,2039,4],[2040,1,2040,4],[2041,1,2041,4],[2042,1,2042,4],[2043,1,2043,4],[2044,1,2044,4],[2033,1,2033,4],[2034,1,2034,4],[2035,1,2035,4],[2036,1,2036,4],[2037,1,2037,4],[2038,1,2038,4],[2027,1,2027,4],[2028,1,2028,4],[2029,1,2029,4],[2030,1,2030,4],[2031,1,2031,4],[2032,1,2032,4],[2021,1,2021,4],[2022,1,2022,4],[2023,1,2023,4],[2024,1,2024,4],[2025,1,2025,4],[2026,1,2026,4],[2015,1,2015,4],[2016,1,2016,4],[2017,1,2017,4],[2018,1,2018,4],[2019,1,2019,4],[2020,1,2020,4],[2009,1,2009,4],[2010,1,2010,4],[2011,1,2011,4],[2012,1,2012,4],[2013,1,2013,4],[2014,1,2014,4],[2003,1,2003,4],[2004,1,2004,4],[2005,1,2005,4],[2006,1,2006,4],[2007,1,2007,4],[2008,1,2008,4],[1997,1,1997,4],[1998,1,1998,4],[1999,1,1999,4],[2000,1,2000,4],[2001,1,2001,4],[2002,1,2002,4],[1991,1,1991,4],[1992,1,1992,4],[1993,1,1993,4],[1994,1,1994,4],[1995,1,1995,4],[1996,1,1996,4],[1985,1,1985,4],[1986,1,1986,4],[1987,1,1987,4],[1988,1,1988,4],[1989,1,1989,4],[1990,1,1990,4],[1979,1,1979,4],[1980,1,1980,4],[1981,1,1981,4],[1982,1,1982,4],[1983,1,1983,4],[1984,1,1984,4],[1973,1,1973,4],[1974,1,1974,4],[1975,1,1975,4],[1976,1,1976,4],[1977,1,1977,4],[1978,1,1978,4],[1967,1,1967,4],[1968,1,1968,4],[1969,1,1969,4],[1970,1,1970,4],[1971,1,1971,4],[1972,1,1972,4],[1961,1,1961,4],[1962,1,1962,4],[1963,1,1963,4],[1964,1,1964,4],[1965,1,1965,4],[1966,1,1966,4],[1955,1,1955,4],[1956,1,1956,4],[1957,1,1957,4],[1958,1,1958,4],[1959,1,1959,4],[1960,1,1960,4],[1949,1,1949,4],[1950,1,1950,4],[1951,1,1951,4],[1952,1,1952,4],[1953,1,1953,4],[1954,1,1954,4],[1943,1,1943,4],[1944,1,1944,4],[1945,1,1945,4],[1946,1,1946,4],[1947,1,1947,4],[1948,1,1948,4],[1937,1,1937,4],[1938,1,1938,4],[1939,1,1939,4],[1940,1,1940,4],[1941,1,1941,4],[1942,1,1942,4],[1931,1,1931,4],[1932,1,1932,4],[1933,1,1933,4],[1934,1,1934,4],[1935,1,1935,4],[1936,1,1936,4],[1925,1,1925,4],[1926,1,1926,4],[1927,1,1927,4],[1928,1,1928,4],[1929,1,1929,4],[1930,1,1930,4],[1919,1,1919,4],[1920,1,1920,4],[1921,1,1921,4],[1922,1,1922,4]],"merged_total":2840,"flags":["merged_cut"]}
["Offeror Name:"]
["Req. No.","Requirement ",null,null,null,null,"Response","Comments","Lock?"]
["1.1.","General Requirements",null,null,null,"General Requirements",null,null,{"$f":"AND(OR(ISNUMBER(SEARCH(\":\",B3)),(LEN(A3)-LEN(SUBSTITUTE(A3,\".\",\"\")))=2),NOT(ISNUMBER(SEARCH(\"Note\",B3))))","v":true}]
["1.1.1.","The CIS shall provide multiple independent Instances including, but not limited to:",null,null,null,"The CIS shall provide multiple independent Instances including, but not limited to:",null,null,{"$f":"AND(OR(ISNUMBER(SEARCH(\":\",B4)),(LEN(A4)-LEN(SUBSTITUTE(A4,\".\",\"\")))=2),NOT(ISNUMBER(SEARCH(\"Note\",B4))))","v":true}]
["1.1.1.1.","Production",null,null,null,"Production",null,null,{"$f":"OR(AND(OR(ISNUMBER(SEARCH(\":\",B5)),(LEN(A5)-LEN(SUBSTITUTE(A5,\".\",\"\")))=2),NOT(ISNUMBER(SEARCH(\"Note\",B5)))),(LEN(B5)-LEN(SUBSTITUTE(B5,\":\",\"\")))=2)","v":false}]
["1.1.1.1.1.","The Production Instance shall be the Instance that Transactions are processed against.",null,null,null,"The Production Instance shall be the Instance that Transactions are processed against.",null,null,false]
["1.1.1.1.2.","The Production Instance shall be automatically backed up on a daily basis.",null,null,null,"The Production Instance shall be automatically backed up on a daily basis.",null,null,false]
["1.1.1.1.3.","The Production Instance shall be backed up on demand.",null,null,null,"The Production Instance shall be backed up on demand.",null,null,false]
["1.1.1.1.4.","The Production Instance shall be restored from a backup.",null,null,null,"The Production Instance shall be restored from a backup.",null,null,false]
["1.1.1.2.","Training",null,null,null,"Training",null,null,false]
["1.1.1.2.1.","The Training Instance shall be automatically refreshed from Production on a daily basis.",null,null,null,"The Training Instance shall be automatically refreshed from Production on a daily basis.",null,null,false]
["1.1.1.3.","Quality Assurance and Testing",null,null,null,"Quality Assurance and Testing",null,null,false]
["1.1.1.3.1.","The Quality Assurance and Testing Instance shall be refreshed from Production on an as-needed basis.",null,null,null,"The Quality Assurance and Testing Instance shall be refreshed from Production on an as-needed basis.",null,null,false]
["1.1.1.4.","Development",null,null,null,"Development",null,null,false]
["1.1.1.4.1.","The Development Instance shall be refreshed from Production on an as-needed basis.",null,null,null,"The Development Instance shall be refreshed from Production on an as-needed basis.",null,null,false]
["1.1.1.5.","The CIS shall backup and restore all non-Production Instances on demand.",null,null,null,"The CIS shall backup and restore all non-Production Instances on demand.",null,null,false]
["1.1.1.6.","The CIS shall refresh any non-Production Instance from another non-Production Instance.",null,null,null,"The CIS shall refresh any non-Production Instance from another non-Production Instance.",null,null,false]
["1.1.2.","The CIS shall enable Users to visually determine what Instance they are currently using.",null,null,null,"The CIS shall enable Users to visually determine what Instance they are currently using.",null,null,false]
["1.1.3.","The CIS shall provide Transactional rollback capabilities.",null,null,null,"The CIS shall provide Transactional rollback capabilities.",null,null,false]
["1.1.3.1.","Each Transaction within CIS shall either be entirely completed or entirely rolled back.",null,null,null,"Each Transaction within CIS shall either be entirely completed or entirely rolled back.",null,null,false]
["1.1.3.2.","In the event of Transaction failure, the CIS shall inform Users as to whether a Transaction was saved or whether it was not saved and needs resubmission.",null,null,null,"In the event of Transaction failure, the CIS shall inform Users as to whether a Transaction was saved or whether it was not saved and needs resubmission.",null,null,false]
["1.1.4.","The CIS shall support attaching documents electronically throughout the CIS.",null,null,null,"The CIS shall support attaching documents electronically throughout the CIS.",null,null,false]
["1.1.4.1.","The CIS shall enable Users to view the file names of the documents that have been attached within the CIS.",null,null,null,"The CIS shall enable Users to view the file names of the documents that have been attached within the CIS.",null,null,false]
["1.1.4.2.","The CIS shall support attaching the following file types, including, but not limited to:",null,null,null,"The CIS shall support attaching the following file types, including, but not limited to:",null,null,true]
["1.1.4.2.1.","*.doc, *.docx (Microsoft Word 2007, 2010, 2013, 2016)",null,null,null,"*.doc, *.docx (Microsoft Word 2007, 2010, 2013, 2016)",null,null,false]
["1.1.4.2.2.","*.xls, *.xlsx (Microsoft Excel 2007, 2010, 2013, 2016)",null,null,null,"*.xls, *.xlsx (Microsoft Excel 2007, 2010, 2013, 2016)",null,null,false]
["1.1.4.2.3.","*.txt (Text)",null,null,null,"*.txt (Text)",null,null,false]
["1.1.4.2.4.","*.pdf (Portable Document Format)",null,null,null,"*.pdf (Portable Document Format)",null,null,false]
["1.1.4.2.5.","*.jpg, *.png, *.gif, *.tif, *.bmp (Image)",null,null,null,"*.jpg, *.png, *.gif, *.tif, *.bmp (Image)",null,null,false]
["1.1.4.2.6.","*.msg (Outlook Mail Message)",null,null,null,"*.msg (Outlook Mail Message)",null,null,false]
{"$rows_left_out":2962}